Reaction Details
TargetCannabinoid receptor 2
LigandBDBM50314120
Substrate/Competitorn/a
Meas. Tech.ChEMBL_627676 (CHEMBL1115256)
IC50 3300±n/a nM
Citation Debenham, JSMadsen-Duggan, CBToupence, RBWalsh, TFWang, JTong, XKumar, SLao, JFong, TMXiao, JCHuang, CRShen, CPFeng, YMarsh, DJStribling, DSShearman, LPStrack, AMGoulet, MT Furo[2,3-b]pyridine-based cannabinoid-1 receptor inverse agonists: synthesis and biological evaluation. Part 1. Bioorg Med Chem Lett20:1448-52 (2010) 
 
Cannabinoid receptor 2
Name:Cannabinoid receptor 2
Type:G Protein-Coupled Receptor (GPCR)
Mol. Mass.:39690.94
Organism:Homo sapiens (Human)
Description:P34972
Residue:360
BDBM50314120
NameBDBM50314120
Synonyms:CHEMBL1090404 | N-(6-(2-chlorophenyl)-5-(4-chlorophenyl)-2-pivaloylfuro[2,3-b]pyridin-3-yl)-2-(methylamino)acetamide
TypeSmall organic molecule
Emp. Form.C27H25Cl2N3O3
Mol. Mass.510.412
SMILESCNCC(=O)Nc1c(oc2nc(-c3ccccc3Cl)c(cc12)-c1ccc(Cl)cc1)C(=O)C(C)(C)C