Reaction Details
TargetCysteine protease
LigandBDBM50314125
Substrate/Competitorn/a
Meas. Tech.ChEMBL_623883 (CHEMBL1105406)
Ki 640±n/a nM
Citation Breuning, ADegel, BSchulz, FBüchold, CStempka, MMachon, UHeppner, SGelhaus, CLeippe, MLeyh, MKisker, CRath, JStich, AGut, JRosenthal, PJSchmuck, CSchirmeister, T Michael acceptor based antiplasmodial and antitrypanosomal cysteine protease inhibitors with unusual amino acids. J Med Chem53:1951-63 (2010) 
 
Cysteine protease
Name:Cysteine protease
Synonyms:Rhodesain
Type:PROTEIN
Mol. Mass.:48425.78
Organism:Trypanosoma brucei rhodesiense
Description:ChEMBL_619861
Residue:450
BDBM50314125
NameBDBM50314125
TypeSmall organic molecule
Emp. Form.C41H45N3O6
Mol. Mass.675.8125
SMILESCCOC(=O)\C=C\[C@H](CCC(=O)NC(c1ccccc1)(c1ccccc1)c1ccccc1)NC(=O)[C@@H](NC(=O)OC(C)(C)C)c1ccccc1