Reaction Details
TargetMitogen-activated protein kinase 10
LigandBDBM50158551
Substrate/Competitorn/a
Meas. Tech.ChEMBL_624063 (CHEMBL1103394)
IC50 150±n/a nM
Citation Siddiqui, MAReddy, PA Small molecule JNK (c-Jun N-terminal kinase) inhibitors. J Med Chem53:3005-12 (2010) 
 
Mitogen-activated protein kinase 10
Name:Mitogen-activated protein kinase 10
Type:Enzyme
Mol. Mass.:52586.89
Organism:Homo sapiens (Human)
Description:n/a
Residue:464
BDBM50158551
NameBDBM50158551
Synonyms:CHEMBL383955 N-5-4-1H-benzo[d][1,2,3]triazol-1-yl)piperidin-1-ylsulfonyl)thiophen-2-yl)methyl)-4-chlorobenzamide
TypeSmall organic molecule
Emp. Form.C23H22ClN5O3S2
Mol. Mass.516.035
SMILESClc1ccc(cc1)C(=O)NCc1ccc(s1)S(=O)(=O)N1CCC(CC1)n1nnc2ccccc12