Reaction Details
TargetDisintegrin and metalloproteinase domain-containing protein 17
LigandBDBM50314222
Substrate/Competitorn/a
Meas. Tech.ChEMBL_624104 (CHEMBL1103435)
IC50 3.2±n/a nM
Citation Nuti, ECasalini, FAvramova, SISantamaria, SFabbi, MFerrini, SMarinelli, LLa Pietra, VLimongelli, VNovellino, ECercignani, GOrlandini, ENencetti, SRossello, A Potent arylsulfonamide inhibitors of tumor necrosis factor-alpha converting enzyme able to reduce activated leukocyte cell adhesion molecule shedding in cancer cell models. J Med Chem53:2622-35 (2010) 
 
Disintegrin and metalloproteinase domain-containing protein 17
Name:Disintegrin and metalloproteinase domain-containing protein 17
Type:Enzyme
Mol. Mass.:93007.89
Organism:Homo sapiens (Human)
Description:
Residue:824
BDBM50314222
NameBDBM50314222
Synonyms:(R)-benzyl 3-(4-(but-2-ynyloxy)phenylsulfonamido)-4-(hydroxyamino)-4-oxobutylcarbamate | CHEMBL1089842
TypeSmall organic molecule
Emp. Form.C22H25N3O7S
Mol. Mass.475.515
SMILESCC#CCOc1ccc(cc1)S(=O)(=O)N[C@H](CCNC(=O)OCc1ccccc1)C(=O)NO