Reaction Details
TargetInterstitial collagenase
LigandBDBM50314221
Substrate/Competitorn/a
Meas. Tech.ChEMBL_624092 (CHEMBL1103423)
IC50 4±n/a nM
Citation Nuti, ECasalini, FAvramova, SISantamaria, SFabbi, MFerrini, SMarinelli, LLa Pietra, VLimongelli, VNovellino, ECercignani, GOrlandini, ENencetti, SRossello, A Potent arylsulfonamide inhibitors of tumor necrosis factor-alpha converting enzyme able to reduce activated leukocyte cell adhesion molecule shedding in cancer cell models. J Med Chem53:2622-35 (2010) 
 
Interstitial collagenase
Name:Interstitial collagenase
Type:Enzyme
Mol. Mass.:54010.26
Organism:Homo sapiens (Human)
Description: P03956
Residue:469
BDBM50314221
NameBDBM50314221
Synonyms:(R)-2-(4-bromophenylsulfonamido)-4-(1,3-dioxoisoindolin-2-yl)-N-hydroxybutanamide | CHEMBL1092104
TypeSmall organic molecule
Emp. Form.C18H16BrN3O6S
Mol. Mass.482.305
SMILESONC(=O)[C@@H](CCN1C(=O)c2ccccc2C1=O)NS(=O)(=O)c1ccc(Br)cc1