Reaction Details
Target72 kDa type IV collagenase
LigandBDBM50294120
Substrate/Competitorn/a
Meas. Tech.ChEMBL_624093 (CHEMBL1103424)
IC50 2±n/a nM
Citation Nuti, ECasalini, FAvramova, SISantamaria, SFabbi, MFerrini, SMarinelli, LLa Pietra, VLimongelli, VNovellino, ECercignani, GOrlandini, ENencetti, SRossello, A Potent arylsulfonamide inhibitors of tumor necrosis factor-alpha converting enzyme able to reduce activated leukocyte cell adhesion molecule shedding in cancer cell models. J Med Chem53:2622-35 (2010) 
 
72 kDa type IV collagenase
Name:72 kDa type IV collagenase
Type:Enzyme
Mol. Mass.:73870.36
Organism:Homo sapiens (Human)
Description: P08253
Residue:660
BDBM50294120
NameBDBM50294120
Synonyms:2-(biphenyl-4-ylsulfonamido)-N-hydroxyacetamide | CHEMBL550148
TypeSmall organic molecule
Emp. Form.C14H14N2O4S
Mol. Mass.306.337
SMILESONC(=O)CNS(=O)(=O)c1ccc(cc1)-c1ccccc1