Reaction Details
Target72 kDa type IV collagenase
LigandBDBM13080
Substrate/Competitorn/a
Meas. Tech.ChEMBL_624093 (CHEMBL1103424)
IC50 13±n/a nM
Citation Nuti, ECasalini, FAvramova, SISantamaria, SFabbi, MFerrini, SMarinelli, LLa Pietra, VLimongelli, VNovellino, ECercignani, GOrlandini, ENencetti, SRossello, A Potent arylsulfonamide inhibitors of tumor necrosis factor-alpha converting enzyme able to reduce activated leukocyte cell adhesion molecule shedding in cancer cell models. J Med Chem53:2622-35 (2010) 
 
72 kDa type IV collagenase
Name:72 kDa type IV collagenase
Type:Enzyme
Mol. Mass.:73870.36
Organism:Homo sapiens (Human)
Description: P08253
Residue:660
BDBM13080
NameBDBM13080
Synonyms:CGS 27023A Analog 3 US20230357139, Compound A
TypeSmall organic molecule
Emp. Form.C13H20N2O5S
Mol. Mass.316.373
SMILESCOc1ccc(cc1)S(=O)(=O)N(CC(C)C)CC(=O)NO