Reaction Details
TargetHistamine H3 receptor
LigandBDBM50314290
Substrate/Competitorn/a
Meas. Tech.ChEMBL_624357 (CHEMBL1107887)
Ki 2±n/a nM
Citation Berlin, MLee, YJBoyce, CWWang, YAslanian, RMcCormick, KDSorota, SWilliams, SMWest, REKorfmacher, W Reduction of hERG inhibitory activity in the 4-piperidinyl urea series of H3 antagonists. Bioorg Med Chem Lett20:2359-64 (2010) 
 
Histamine H3 receptor
Name:Histamine H3 receptor
Type:G Protein-Coupled Receptor (GPCR)
Mol. Mass.:48691.47
Organism:Homo sapiens (Human)
Description:Binding assays were using CHO cells stably expressing hH3R receptors.
Residue:445
BDBM50314290
NameBDBM50314290
Synonyms:3-benzyl-1-(4-bromophenyl)-1-(1-(pyridin-4-ylmethyl)piperidin-4-yl)urea | CHEMBL1092108
TypeSmall organic molecule
Emp. Form.C25H27BrN4O
Mol. Mass.479.412
SMILESBrc1ccc(cc1)N(C1CCN(Cc2ccncc2)CC1)C(=O)NCc1ccccc1