Reaction Details
TargetHistamine H3 receptor
LigandBDBM50314288
Substrate/Competitorn/a
Meas. Tech.ChEMBL_624357 (CHEMBL1107887)
Ki 3±n/a nM
Citation Berlin, MLee, YJBoyce, CWWang, YAslanian, RMcCormick, KDSorota, SWilliams, SMWest, REKorfmacher, W Reduction of hERG inhibitory activity in the 4-piperidinyl urea series of H3 antagonists. Bioorg Med Chem Lett20:2359-64 (2010) 
 
Histamine H3 receptor
Name:Histamine H3 receptor
Type:G Protein-Coupled Receptor (GPCR)
Mol. Mass.:48691.47
Organism:Homo sapiens (Human)
Description:Binding assays were using CHO cells stably expressing hH3R receptors.
Residue:445
BDBM50314288
NameBDBM50314288
Synonyms:1-(1-((2-aminopyridin-4-yl)methyl)piperidin-4-yl)-1-(4-chlorophenyl)-3-(4-fluorobenzyl)urea | CHEMBL1091836
TypeSmall organic molecule
Emp. Form.C25H27ClFN5O
Mol. Mass.467.966
SMILESNc1cc(CN2CCC(CC2)N(C(=O)NCc2ccc(F)cc2)c2ccc(Cl)cc2)ccn1