Reaction Details
TargetSerine/threonine-protein kinase mTOR
LigandBDBM50314332
Substrate/Competitorn/a
Meas. Tech.ChEMBL_624363 (CHEMBL1107893)
IC50 3.5±n/a nM
Citation Tsou, HRMacEwan, GBirnberg, GZhang, NBrooijmans, NToral-Barza, LHollander, IAyral-Kaloustian, SYu, K 4-Substituted-7-azaindoles bearing a ureidobenzofuranone moiety as potent and selective, ATP-competitive inhibitors of the mammalian target of rapamycin (mTOR). Bioorg Med Chem Lett20:2259-63 (2010) 
 
Serine/threonine-protein kinase mTOR
Name:Serine/threonine-protein kinase mTOR
Type:Rapamycin target protein
Mol. Mass.:288917.12
Organism:Homo sapiens (Human)
Description:P42345
Residue:2549
BDBM50314332
NameBDBM50314332
Synonyms:4-hydroxy-2-((1-methyl-4-phenyl-1H-pyrrolo[2,3-b]pyridin-3-yl)methylene)benzofuran-3(2H)-one | CHEMBL1090043
TypeSmall organic molecule
Emp. Form.C23H16N2O3
Mol. Mass.368.3847
SMILESCn1cc(\C=C2/Oc3cccc(O)c3C2=O)c2c(ccnc12)-c1ccccc1