Reaction Details
TargetSerine/threonine-protein kinase mTOR
LigandBDBM50314339
Substrate/Competitorn/a
Meas. Tech.ChEMBL_624363 (CHEMBL1107893)
IC50 8.2±n/a nM
Citation Tsou, HRMacEwan, GBirnberg, GZhang, NBrooijmans, NToral-Barza, LHollander, IAyral-Kaloustian, SYu, K 4-Substituted-7-azaindoles bearing a ureidobenzofuranone moiety as potent and selective, ATP-competitive inhibitors of the mammalian target of rapamycin (mTOR). Bioorg Med Chem Lett20:2259-63 (2010) 
 
Serine/threonine-protein kinase mTOR
Name:Serine/threonine-protein kinase mTOR
Type:Rapamycin target protein
Mol. Mass.:288917.12
Organism:Homo sapiens (Human)
Description:P42345
Residue:2549
BDBM50314339
NameBDBM50314339
Synonyms:(Z)-1-(2-((4-(4-(3-methoxypyrrolidine-1-carbonyl)piperidin-1-yl)-1-methyl-1H-pyrrolo[2,3-b]pyridin-3-yl)methylene)-3-oxo-2,3-dihydrobenzofuran-5-yl)-3-(pyridin-3-yl)urea | CHEMBL1091702
TypeSmall organic molecule
Emp. Form.C34H35N7O5
Mol. Mass.621.6856
SMILESCOC1CCN(C1)C(=O)C1CCN(CC1)c1ccnc2n(C)cc(\C=C3/Oc4ccc(NC(=O)Nc5cccnc5)cc4C3=O)c12