Reaction Details
TargetPhosphatidylinositol 4,5-bisphosphate 3-kinase catalytic subunit alpha isoform
LigandBDBM50314364
Substrate/Competitorn/a
Meas. Tech.ChEMBL_624369 (CHEMBL1107899)
IC50 52±n/a nM
Citation Tsou, HRMacEwan, GBirnberg, GGrosu, GBursavich, MGBard, JBrooijmans, NToral-Barza, LHollander, IMansour, TSAyral-Kaloustian, SYu, K Discovery and optimization of 2-(4-substituted-pyrrolo[2,3-b]pyridin-3-yl)methylene-4-hydroxybenzofuran-3(2H)-ones as potent and selective ATP-competitive inhibitors of the mammalian target of rapamycin (mTOR). Bioorg Med Chem Lett20:2321-5 (2010) 
 
Phosphatidylinositol 4,5-bisphosphate 3-kinase catalytic subunit alpha isoform
Name:Phosphatidylinositol 4,5-bisphosphate 3-kinase catalytic subunit alpha isoform
Type:Enzyme Subunit
Mol. Mass.:124294.87
Organism:Homo sapiens (Human)
Description:P42336
Residue:1068
BDBM50314364
NameBDBM50314364
Synonyms:2-((4-(4-(8-oxa-3-azabicyclo[3.2.1]octane-3-carbonyl)piperidin-1-yl)-1-methyl-1H-pyrrolo[2,3-b]pyridin-3-yl)methylene)-4-hydroxybenzofuran-3(2H)-one | CHEMBL1090388
TypeSmall organic molecule
Emp. Form.C29H30N4O5
Mol. Mass.514.5723
SMILESCn1cc(\C=C2/Oc3cccc(O)c3C2=O)c2c(ccnc12)N1CCC(CC1)C(=O)N1CC2CCC(C1)O2