Reaction Details
TargetPhosphatidylinositol 4,5-bisphosphate 3-kinase catalytic subunit alpha isoform
LigandBDBM50314345
Substrate/Competitorn/a
Meas. Tech.ChEMBL_624369 (CHEMBL1107899)
IC50 5895±n/a nM
Citation Tsou, HRMacEwan, GBirnberg, GGrosu, GBursavich, MGBard, JBrooijmans, NToral-Barza, LHollander, IMansour, TSAyral-Kaloustian, SYu, K Discovery and optimization of 2-(4-substituted-pyrrolo[2,3-b]pyridin-3-yl)methylene-4-hydroxybenzofuran-3(2H)-ones as potent and selective ATP-competitive inhibitors of the mammalian target of rapamycin (mTOR). Bioorg Med Chem Lett20:2321-5 (2010) 
 
Phosphatidylinositol 4,5-bisphosphate 3-kinase catalytic subunit alpha isoform
Name:Phosphatidylinositol 4,5-bisphosphate 3-kinase catalytic subunit alpha isoform
Type:Enzyme Subunit
Mol. Mass.:124294.87
Organism:Homo sapiens (Human)
Description:P42336
Residue:1068
BDBM50314345
NameBDBM50314345
Synonyms:2-(3-((4-hydroxy-3-oxobenzofuran-2(3H)-ylidene)methyl)-1-methyl-1H-pyrrolo[2,3-b]pyridin-4-yl)-N,N-dimethylbenzamide | CHEMBL1092818
TypeSmall organic molecule
Emp. Form.C26H21N3O4
Mol. Mass.439.4626
SMILESCN(C)C(=O)c1ccccc1-c1ccnc2n(C)cc(\C=C3/Oc4cccc(O)c4C3=O)c12