Reaction Details
TargetPlatelet-derived growth factor receptor alpha
LigandBDBM50314344
Substrate/Competitorn/a
Meas. Tech.ChEMBL_624539 (CHEMBL1110588)
IC50 50000±n/a nM
Citation Tsou, HRMacEwan, GBirnberg, GGrosu, GBursavich, MGBard, JBrooijmans, NToral-Barza, LHollander, IMansour, TSAyral-Kaloustian, SYu, K Discovery and optimization of 2-(4-substituted-pyrrolo[2,3-b]pyridin-3-yl)methylene-4-hydroxybenzofuran-3(2H)-ones as potent and selective ATP-competitive inhibitors of the mammalian target of rapamycin (mTOR). Bioorg Med Chem Lett20:2321-5 (2010) 
 
Platelet-derived growth factor receptor alpha
Name:Platelet-derived growth factor receptor alpha
Type:Protein
Mol. Mass.:122633.38
Organism:Homo sapiens (Human)
Description:P16234
Residue:1089
BDBM50314344
NameBDBM50314344
Synonyms:4-(3-((4-hydroxy-3-oxobenzofuran-2(3H)-ylidene)methyl)-1-methyl-1H-pyrrolo[2,3-b]pyridin-4-yl)-N-(2-hydroxyethyl)benzamide | CHEMBL1092754
TypeSmall organic molecule
Emp. Form.C26H21N3O5
Mol. Mass.455.462
SMILESCn1cc(\C=C2/Oc3cccc(O)c3C2=O)c2c(ccnc12)-c1ccc(cc1)C(=O)NCCO