Reaction Details
TargetSerine/threonine-protein kinase mTOR
LigandBDBM50314360
Substrate/Competitorn/a
Meas. Tech.ChEMBL_624367 (CHEMBL1107897)
IC50 0.670000±n/a nM
Citation Tsou, HRMacEwan, GBirnberg, GGrosu, GBursavich, MGBard, JBrooijmans, NToral-Barza, LHollander, IMansour, TSAyral-Kaloustian, SYu, K Discovery and optimization of 2-(4-substituted-pyrrolo[2,3-b]pyridin-3-yl)methylene-4-hydroxybenzofuran-3(2H)-ones as potent and selective ATP-competitive inhibitors of the mammalian target of rapamycin (mTOR). Bioorg Med Chem Lett20:2321-5 (2010) 
 
Serine/threonine-protein kinase mTOR
Name:Serine/threonine-protein kinase mTOR
Type:Rapamycin target protein
Mol. Mass.:288917.12
Organism:Homo sapiens (Human)
Description:P42345
Residue:2549
BDBM50314360
NameBDBM50314360
Synonyms:1-(3-((4-hydroxy-3-oxobenzofuran-2(3H)-ylidene)methyl)-1-methyl-1H-pyrrolo[2,3-b]pyridin-4-yl)-N,N-dimethylpiperidine-4-carboxamide | CHEMBL1091491
TypeSmall organic molecule
Emp. Form.C25H26N4O4
Mol. Mass.446.4983
SMILESCN(C)C(=O)C1CCN(CC1)c1ccnc2n(C)cc(\C=C3/Oc4cccc(O)c4C3=O)c12