Reaction Details
TargetSerine/threonine-protein kinase mTOR
LigandBDBM50314363
Substrate/Competitorn/a
Meas. Tech.ChEMBL_624367 (CHEMBL1107897)
IC50 0.560000±n/a nM
Citation Tsou, HRMacEwan, GBirnberg, GGrosu, GBursavich, MGBard, JBrooijmans, NToral-Barza, LHollander, IMansour, TSAyral-Kaloustian, SYu, K Discovery and optimization of 2-(4-substituted-pyrrolo[2,3-b]pyridin-3-yl)methylene-4-hydroxybenzofuran-3(2H)-ones as potent and selective ATP-competitive inhibitors of the mammalian target of rapamycin (mTOR). Bioorg Med Chem Lett20:2321-5 (2010) 
 
Serine/threonine-protein kinase mTOR
Name:Serine/threonine-protein kinase mTOR
Type:Rapamycin target protein
Mol. Mass.:288917.12
Organism:Homo sapiens (Human)
Description:P42345
Residue:2549
BDBM50314363
NameBDBM50314363
Synonyms:(Z)-2-((4-(4-(8-oxa-3-azabicyclo[3.2.1]octane-3-carbonyl)phenyl)-1-methyl-1H-pyrrolo[2,3-b]pyridin-3-yl)methylene)-4-hydroxybenzofuran-3(2H)-one | CHEMBL1092120
TypeSmall organic molecule
Emp. Form.C30H25N3O5
Mol. Mass.507.5366
SMILESCn1cc(\C=C2/Oc3cccc(O)c3C2=O)c2c(ccnc12)-c1ccc(cc1)C(=O)N1CC2CCC(C1)O2