Reaction Details
TargetSerine/threonine-protein kinase mTOR
LigandBDBM50314366
Substrate/Competitorn/a
Meas. Tech.ChEMBL_624367 (CHEMBL1107897)
IC50 3.1±n/a nM
Citation Tsou, HRMacEwan, GBirnberg, GGrosu, GBursavich, MGBard, JBrooijmans, NToral-Barza, LHollander, IMansour, TSAyral-Kaloustian, SYu, K Discovery and optimization of 2-(4-substituted-pyrrolo[2,3-b]pyridin-3-yl)methylene-4-hydroxybenzofuran-3(2H)-ones as potent and selective ATP-competitive inhibitors of the mammalian target of rapamycin (mTOR). Bioorg Med Chem Lett20:2321-5 (2010) 
 
Serine/threonine-protein kinase mTOR
Name:Serine/threonine-protein kinase mTOR
Type:Rapamycin target protein
Mol. Mass.:288917.12
Organism:Homo sapiens (Human)
Description:P42345
Residue:2549
BDBM50314366
NameBDBM50314366
Synonyms:4-hydroxy-2-((1-methyl-4-(4-(4-methylpiperazine-1-carbonyl)piperidin-1-yl)-1H-pyrrolo[2,3-b]pyridin-3-yl)methylene)benzofuran-3(2H)-one | CHEMBL1092486
TypeSmall organic molecule
Emp. Form.C28H31N5O4
Mol. Mass.501.5768
SMILESCN1CCN(CC1)C(=O)C1CCN(CC1)c1ccnc2n(C)cc(\C=C3/Oc4cccc(O)c4C3=O)c12