Reaction Details
TargetSphingosine 1-phosphate receptor 1
LigandBDBM50314401
Substrate/Competitorn/a
Meas. Tech.ChEMBL_624580 (CHEMBL1110629)
EC50 0.077±n/a nM
Citation Ma, BGuckian, KMLin, EYLee, WCScott, DKumaravel, GMacdonald, TLLynch, KRBlack, CChollate, SHahm, KHetu, GJin, PLuo, YRohde, ERossomando, AScannevin, RWang, JYang, C Stereochemistry-activity relationship of orally active tetralin S1P agonist prodrugs. Bioorg Med Chem Lett20:2264-9 (2010) 
 
Sphingosine 1-phosphate receptor 1
Name:Sphingosine 1-phosphate receptor 1
Type:Enzyme
Mol. Mass.:42836.02
Organism:Homo sapiens (Human)
Description:P21453
Residue:382
BDBM50314401
NameBDBM50314401
Synonyms:2-amino-3-hydroxy-2-((R)-6-octyl-1,2,3,4-tetrahydronaphthalen-2-yl)propyl dihydrogen phosphate | CHEMBL1091103
TypeSmall organic molecule
Emp. Form.C21H36NO5P
Mol. Mass.413.488
SMILESCCCCCCCCc1ccc2C[C@@H](CCc2c1)C(N)(CO)COP(O)(O)=O