Reaction Details
TargetSphingosine 1-phosphate receptor 2
LigandBDBM50314401
Substrate/Competitorn/a
Meas. Tech.ChEMBL_624583 (CHEMBL1110632)
EC50>5000±n/a nM
Citation Ma, BGuckian, KMLin, EYLee, WCScott, DKumaravel, GMacdonald, TLLynch, KRBlack, CChollate, SHahm, KHetu, GJin, PLuo, YRohde, ERossomando, AScannevin, RWang, JYang, C Stereochemistry-activity relationship of orally active tetralin S1P agonist prodrugs. Bioorg Med Chem Lett20:2264-9 (2010) 
 
Sphingosine 1-phosphate receptor 2
Name:Sphingosine 1-phosphate receptor 2
Type:G Protein-Coupled Receptor (GPCR)
Mol. Mass.:38883.16
Organism:Homo sapiens (Human)
Description:Membranes isolated from S1P2-transfected CHO cells were used in ligand binding assay.
Residue:353
BDBM50314401
NameBDBM50314401
Synonyms:2-amino-3-hydroxy-2-((R)-6-octyl-1,2,3,4-tetrahydronaphthalen-2-yl)propyl dihydrogen phosphate | CHEMBL1091103
TypeSmall organic molecule
Emp. Form.C21H36NO5P
Mol. Mass.413.488
SMILESCCCCCCCCc1ccc2C[C@@H](CCc2c1)C(N)(CO)COP(O)(O)=O