Reaction Details
TargetEukaryotic elongation factor 2 kinase
LigandBDBM50314409
Substrate/Competitorn/a
Meas. Tech.ChEMBL_624587 (CHEMBL1111547)
IC50 860±n/a nM
Citation Lockman, JWReeder, MDSuzuki, KOstanin, KHoff, RBhoite, LAustin, HBaichwal, VAdam Willardsen, J Inhibition of eEF2-K by thieno[2,3-b]pyridine analogues. Bioorg Med Chem Lett20:2283-6 (2010) 
 
Eukaryotic elongation factor 2 kinase
Name:Eukaryotic elongation factor 2 kinase
Type:Protein
Mol. Mass.:82116.99
Organism:Homo sapiens (Human)
Description:n/a
Residue:725
BDBM50314409
NameBDBM50314409
Synonyms:3-amino-4-isobutyl-5,6,7,8,9,10-hexahydrocycloocta[b]thieno[3,2-e]pyridine-2-carboxamide | CHEMBL1089016
TypeSmall organic molecule
Emp. Form.C18H25N3OS
Mol. Mass.331.476
SMILESCC(C)Cc1c2CCCCCCc2nc2sc(C(N)=O)c(N)c12