Reaction Details
TargetEukaryotic elongation factor 2 kinase
LigandBDBM50314413
Substrate/Competitorn/a
Meas. Tech.ChEMBL_624587 (CHEMBL1111547)
IC50 1100±n/a nM
Citation Lockman, JWReeder, MDSuzuki, KOstanin, KHoff, RBhoite, LAustin, HBaichwal, VAdam Willardsen, J Inhibition of eEF2-K by thieno[2,3-b]pyridine analogues. Bioorg Med Chem Lett20:2283-6 (2010) 
 
Eukaryotic elongation factor 2 kinase
Name:Eukaryotic elongation factor 2 kinase
Type:Protein
Mol. Mass.:82116.99
Organism:Homo sapiens (Human)
Description:n/a
Residue:725
BDBM50314413
NameBDBM50314413
Synonyms:3-amino-4-(4-chlorophenyl)-5,6,7,8,9,10-hexahydrocycloocta[b]thieno[3,2-e]pyridine-2-carboxamide | CHEMBL1093355
TypeSmall organic molecule
Emp. Form.C20H20ClN3OS
Mol. Mass.385.91
SMILESNC(=O)c1sc2nc3CCCCCCc3c(-c3ccc(Cl)cc3)c2c1N