Reaction Details
TargetEukaryotic elongation factor 2 kinase
LigandBDBM50314421
Substrate/Competitorn/a
Meas. Tech.ChEMBL_624587 (CHEMBL1111547)
IC50 940±n/a nM
Citation Lockman, JWReeder, MDSuzuki, KOstanin, KHoff, RBhoite, LAustin, HBaichwal, VAdam Willardsen, J Inhibition of eEF2-K by thieno[2,3-b]pyridine analogues. Bioorg Med Chem Lett20:2283-6 (2010) 
 
Eukaryotic elongation factor 2 kinase
Name:Eukaryotic elongation factor 2 kinase
Type:Protein
Mol. Mass.:82116.99
Organism:Homo sapiens (Human)
Description:n/a
Residue:725
BDBM50314421
NameBDBM50314421
Synonyms:3-amino-4-(pyridin-3-yl)-5,6,7,8,9,10-hexahydrocycloocta[b]thieno[3,2-e]pyridine-2-carboxamide | CHEMBL1089330
TypeSmall organic molecule
Emp. Form.C19H20N4OS
Mol. Mass.352.453
SMILESNC(=O)c1sc2nc3CCCCCCc3c(-c3cccnc3)c2c1N