Reaction Details
TargetEukaryotic elongation factor 2 kinase
LigandBDBM50314435
Substrate/Competitorn/a
Meas. Tech.ChEMBL_624587 (CHEMBL1111547)
IC50 1100±n/a nM
Citation Lockman, JWReeder, MDSuzuki, KOstanin, KHoff, RBhoite, LAustin, HBaichwal, VAdam Willardsen, J Inhibition of eEF2-K by thieno[2,3-b]pyridine analogues. Bioorg Med Chem Lett20:2283-6 (2010) 
 
Eukaryotic elongation factor 2 kinase
Name:Eukaryotic elongation factor 2 kinase
Type:Protein
Mol. Mass.:82116.99
Organism:Homo sapiens (Human)
Description:n/a
Residue:725
BDBM50314435
NameBDBM50314435
Synonyms:3-amino-4-(furan-2-yl)-6,7,8,9-tetrahydro-5H-cyclohepta[e]thieno[2,3-b]pyridine-2-carboxamide | CHEMBL1093963
TypeSmall organic molecule
Emp. Form.C17H17N3O2S
Mol. Mass.327.401
SMILESNC(=O)c1sc2nc3CCCCCc3c(-c3ccco3)c2c1N