Reaction Details
TargetEukaryotic elongation factor 2 kinase
LigandBDBM50314444
Substrate/Competitorn/a
Meas. Tech.ChEMBL_624587 (CHEMBL1111547)
IC50 110±n/a nM
Citation Lockman, JWReeder, MDSuzuki, KOstanin, KHoff, RBhoite, LAustin, HBaichwal, VAdam Willardsen, J Inhibition of eEF2-K by thieno[2,3-b]pyridine analogues. Bioorg Med Chem Lett20:2283-6 (2010) 
 
Eukaryotic elongation factor 2 kinase
Name:Eukaryotic elongation factor 2 kinase
Type:Protein
Mol. Mass.:82116.99
Organism:Homo sapiens (Human)
Description:n/a
Residue:725
BDBM50314444
NameBDBM50314444
Synonyms:2-(4-chlorophenyl)-10-thia-5,7,12-triazatetracyclo[11.7.0.0^{3,11}.0^{4,9}]icosa-1(13),2,4(9),5,7,11-hexaen-8-amine | CHEMBL1094018
TypeSmall organic molecule
Emp. Form.C22H21ClN4S
Mol. Mass.408.947
SMILESNc1ncnc2c1sc1nc3CCCCCCCc3c(-c3ccc(Cl)cc3)c21