Reaction Details
TargetCytochrome P450 3A4
LigandBDBM50314499
Substrate/Competitorn/a
Meas. Tech.ChEMBL_624608 (CHEMBL1111568)
Ki 240±n/a nM
Citation McNulty, JNair, JJSingh, MCrankshaw, DJHolloway, AC Potent and selective inhibition of human cytochrome P450 3A4 by seco-pancratistatin structural analogs. Bioorg Med Chem Lett20:2335-9 (2010) 
 
Cytochrome P450 3A4
Name:Cytochrome P450 3A4
Type:Enzyme
Mol. Mass.:57349.57
Organism:Homo sapiens (Human)
Description:n/a
Residue:503
BDBM50314499
NameBDBM50314499
Synonyms:CHEMBL1089300 | tert-butyl(2S,3S)-2-(benzo[d][1,3]dioxol-5-yl)-3-((4S,5S)-5-((tert-butyldimethylsilyloxy)methyl)-2,2-dimethyl-1,3-dioxolan-4-yl)-3-(methoxymethoxy)propylcarbamate
TypeSmall organic molecule
Emp. Form.C29H49NO9Si
Mol. Mass.583.7862
SMILESCOCO[C@@H]([C@H](CNC(=O)OC(C)(C)C)c1ccc2OCOc2c1)[C@@H]1OC(C)(C)O[C@H]1CO[Si](C)(C)C(C)(C)C