Reaction Details
TargetCytochrome P450 3A4
LigandBDBM50314500
Substrate/Competitorn/a
Meas. Tech.ChEMBL_624608 (CHEMBL1111568)
Ki 1780±n/a nM
Citation McNulty, JNair, JJSingh, MCrankshaw, DJHolloway, AC Potent and selective inhibition of human cytochrome P450 3A4 by seco-pancratistatin structural analogs. Bioorg Med Chem Lett20:2335-9 (2010) 
 
Cytochrome P450 3A4
Name:Cytochrome P450 3A4
Type:Enzyme
Mol. Mass.:57349.57
Organism:Homo sapiens (Human)
Description:n/a
Residue:503
BDBM50314500
NameBDBM50314500
Synonyms:CHEMBL1091763 | N-((2S,3S)-2-(benzo[d][1,3]dioxol-5-yl)-3-((4S,5S)-5-(hydroxymethyl)-2,2-dimethyl-1,3-dioxolan-4-yl)-3-(methoxymethoxy)propyl)benzamide
TypeSmall organic molecule
Emp. Form.C25H31NO8
Mol. Mass.473.5155
SMILESCOCO[C@@H]([C@H](CNC(=O)c1ccccc1)c1ccc2OCOc2c1)[C@@H]1OC(C)(C)O[C@H]1CO