Reaction Details
TargetOxytocin receptor
LigandBDBM50314515
Substrate/Competitorn/a
Meas. Tech.ChEMBL_624611 (CHEMBL1111571)
Ki 41±n/a nM
Citation Brown, AEllis, DWallace, ORalph, M Identification of amide bioisosteres of triazole oxytocin antagonists. Bioorg Med Chem Lett20:2224-8 (2010) 
 
Oxytocin receptor
Name:Oxytocin receptor
Type:Enzyme Catalytic Domain
Mol. Mass.:42793.26
Organism:Homo sapiens (Human)
Description:Oxytocin OXTR HEK293::B2R9L7
Residue:389
BDBM50314515
NameBDBM50314515
Synonyms:CHEMBL1093776 | N-ethyl-N-(6-methoxypyridin-3-yl)-3-p-tolyl-1H-pyrazole-5-carboxamide
TypeSmall organic molecule
Emp. Form.C19H20N4O2
Mol. Mass.336.3877
SMILESCCN(C(=O)c1cc(n[nH]1)-c1ccc(C)cc1)c1ccc(OC)nc1