Reaction Details
TargetOxytocin receptor
LigandBDBM50314520
Substrate/Competitorn/a
Meas. Tech.ChEMBL_624611 (CHEMBL1111571)
Ki 85±n/a nM
Citation Brown, AEllis, DWallace, ORalph, M Identification of amide bioisosteres of triazole oxytocin antagonists. Bioorg Med Chem Lett20:2224-8 (2010) 
 
Oxytocin receptor
Name:Oxytocin receptor
Type:Enzyme Catalytic Domain
Mol. Mass.:42793.26
Organism:Homo sapiens (Human)
Description:Oxytocin OXTR HEK293::B2R9L7
Residue:389
BDBM50314520
NameBDBM50314520
Synonyms:CHEMBL1093341 | N-ethyl-5-methoxy-N-(6-methoxypyridin-3-yl)benzofuran-2-carboxamide
TypeSmall organic molecule
Emp. Form.C18H18N2O4
Mol. Mass.326.3465
SMILESCCN(C(=O)c1cc2cc(OC)ccc2o1)c1ccc(OC)nc1