Reaction Details
TargetOxytocin receptor
LigandBDBM50314522
Substrate/Competitorn/a
Meas. Tech.ChEMBL_624611 (CHEMBL1111571)
Ki 48±n/a nM
Citation Brown, AEllis, DWallace, ORalph, M Identification of amide bioisosteres of triazole oxytocin antagonists. Bioorg Med Chem Lett20:2224-8 (2010) 
 
Oxytocin receptor
Name:Oxytocin receptor
Type:Enzyme Catalytic Domain
Mol. Mass.:42793.26
Organism:Homo sapiens (Human)
Description:Oxytocin OXTR HEK293::B2R9L7
Residue:389
BDBM50314522
NameBDBM50314522
Synonyms:CHEMBL1089272 | N-ethyl-N-(6-methoxypyridin-3-yl)-2-(naphthalen-2-yloxy)acetamide
TypeSmall organic molecule
Emp. Form.C20H20N2O3
Mol. Mass.336.3844
SMILESCCN(C(=O)COc1ccc2ccccc2c1)c1ccc(OC)nc1