Reaction Details
TargetcAMP-specific 3',5'-cyclic phosphodiesterase 4B
LigandBDBM50314567
Substrate/Competitorn/a
Meas. Tech.ChEMBL_625097 (CHEMBL1112546)
Ki 14000±n/a nM
Citation Donnell, AFDollings, PJButera, JADietrich, AJLipinski, KKGhavami, AHirst, WD Identification of pyridazino[4,5-b]indolizines as selective PDE4B inhibitors. Bioorg Med Chem Lett20:2163-7 (2010) 
 
cAMP-specific 3',5'-cyclic phosphodiesterase 4B
Name:cAMP-specific 3',5'-cyclic phosphodiesterase 4B
Type:Protein
Mol. Mass.:83318.87
Organism:Homo sapiens (Human)
Description:Q07343
Residue:736
BDBM50314567
NameBDBM50314567
Synonyms:CHEMBL1090031 | cyclopentyl(4-(3-(4-(3-fluorophenyl)pyridazino[4,5-b]indolizin-1-ylamino)propyl)piperazin-1-yl)methanone
TypeSmall organic molecule
Emp. Form.C29H33FN6O
Mol. Mass.500.6103
SMILESFc1cccc(c1)-c1nnc(NCCCN2CCN(CC2)C(=O)C2CCCC2)c2cc3ccccn3c12