Reaction Details
TargetcAMP-specific 3',5'-cyclic phosphodiesterase 4B
LigandBDBM50314575
Substrate/Competitorn/a
Meas. Tech.ChEMBL_625097 (CHEMBL1112546)
Ki 1000±n/a nM
Citation Donnell, AFDollings, PJButera, JADietrich, AJLipinski, KKGhavami, AHirst, WD Identification of pyridazino[4,5-b]indolizines as selective PDE4B inhibitors. Bioorg Med Chem Lett20:2163-7 (2010) 
 
cAMP-specific 3',5'-cyclic phosphodiesterase 4B
Name:cAMP-specific 3',5'-cyclic phosphodiesterase 4B
Type:Protein
Mol. Mass.:83318.87
Organism:Homo sapiens (Human)
Description:Q07343
Residue:736
BDBM50314575
NameBDBM50314575
Synonyms:(4-(3-(1,2-dimethyl-7-(3-nitrophenyl)-1H-pyrrolo[3,2-d]pyridazin-4-ylamino)propyl)piperazin-1-yl)(pyrimidin-2-yl)methanone | CHEMBL1090702
TypeSmall organic molecule
Emp. Form.C26H29N9O3
Mol. Mass.515.567
SMILESCc1cc2c(NCCCN3CCN(CC3)C(=O)c3ncccn3)nnc(-c3cccc(c3)[N+]([O-])=O)c2n1C