Reaction Details
TargetcAMP-specific 3',5'-cyclic phosphodiesterase 4B
LigandBDBM50314580
Substrate/Competitorn/a
Meas. Tech.ChEMBL_625097 (CHEMBL1112546)
Ki 977±n/a nM
Citation Donnell, AFDollings, PJButera, JADietrich, AJLipinski, KKGhavami, AHirst, WD Identification of pyridazino[4,5-b]indolizines as selective PDE4B inhibitors. Bioorg Med Chem Lett20:2163-7 (2010) 
 
cAMP-specific 3',5'-cyclic phosphodiesterase 4B
Name:cAMP-specific 3',5'-cyclic phosphodiesterase 4B
Type:Protein
Mol. Mass.:83318.87
Organism:Homo sapiens (Human)
Description:Q07343
Residue:736
BDBM50314580
NameBDBM50314580
Synonyms:(4-(3-(1,2-dimethyl-7-(3-nitrophenyl)-1H-pyrrolo[3,2-d]pyridazin-4-ylamino)propyl)piperazin-1-yl)(1,2,3-thiadiazol-4-yl)methanone | CHEMBL1090048
TypeSmall organic molecule
Emp. Form.C24H27N9O3S
Mol. Mass.521.595
SMILESCc1cc2c(NCCCN3CCN(CC3)C(=O)c3c[s+]n[n-]3)nnc(-c3cccc(c3)[N+]([O-])=O)c2n1C