Reaction Details
TargetcAMP-specific 3',5'-cyclic phosphodiesterase 4D
LigandBDBM50314583
Substrate/Competitorn/a
Meas. Tech.ChEMBL_625098 (CHEMBL1112547)
Ki 4440±n/a nM
Citation Donnell, AFDollings, PJButera, JADietrich, AJLipinski, KKGhavami, AHirst, WD Identification of pyridazino[4,5-b]indolizines as selective PDE4B inhibitors. Bioorg Med Chem Lett20:2163-7 (2010) 
 
cAMP-specific 3',5'-cyclic phosphodiesterase 4D
Name:cAMP-specific 3',5'-cyclic phosphodiesterase 4D
Type:Protein
Mol. Mass.:91092.69
Organism:Homo sapiens (Human)
Description:Q08499
Residue:809
BDBM50314583
NameBDBM50314583
Synonyms:(4-(3-(1,2-dimethyl-7-(3-nitrophenyl)-1H-pyrrolo[3,2-d]pyridazin-4-ylamino)propyl)piperazin-1-yl)(pyrazin-2-yl)methanone | CHEMBL1092099
TypeSmall organic molecule
Emp. Form.C26H29N9O3
Mol. Mass.515.567
SMILESCc1cc2c(NCCCN3CCN(CC3)C(=O)c3cnccn3)nnc(-c3cccc(c3)[N+]([O-])=O)c2n1C