Reaction Details
TargetcAMP-specific 3',5'-cyclic phosphodiesterase 4D
LigandBDBM50314558
Substrate/Competitorn/a
Meas. Tech.ChEMBL_625098 (CHEMBL1112547)
Ki 8370±n/a nM
Citation Donnell, AFDollings, PJButera, JADietrich, AJLipinski, KKGhavami, AHirst, WD Identification of pyridazino[4,5-b]indolizines as selective PDE4B inhibitors. Bioorg Med Chem Lett20:2163-7 (2010) 
 
cAMP-specific 3',5'-cyclic phosphodiesterase 4D
Name:cAMP-specific 3',5'-cyclic phosphodiesterase 4D
Type:Protein
Mol. Mass.:91092.69
Organism:Homo sapiens (Human)
Description:Q08499
Residue:809
BDBM50314558
NameBDBM50314558
Synonyms:(4-(3-(4-phenylpyridazino[4,5-b]indolizin-1-ylamino)propyl)piperazin-1-yl)(pyrazin-2-yl)methanone | CHEMBL1090016
TypeSmall organic molecule
Emp. Form.C28H28N8O
Mol. Mass.492.5749
SMILESO=C(N1CCN(CCCNc2nnc(-c3ccccc3)c3c2cc2ccccn32)CC1)c1cnccn1