Reaction Details
TargetcAMP-specific 3',5'-cyclic phosphodiesterase 4D
LigandBDBM50314557
Substrate/Competitorn/a
Meas. Tech.ChEMBL_625098 (CHEMBL1112547)
Ki 147±n/a nM
Citation Donnell, AFDollings, PJButera, JADietrich, AJLipinski, KKGhavami, AHirst, WD Identification of pyridazino[4,5-b]indolizines as selective PDE4B inhibitors. Bioorg Med Chem Lett20:2163-7 (2010) 
 
cAMP-specific 3',5'-cyclic phosphodiesterase 4D
Name:cAMP-specific 3',5'-cyclic phosphodiesterase 4D
Type:Protein
Mol. Mass.:91092.69
Organism:Homo sapiens (Human)
Description:Q08499
Residue:809
BDBM50314557
NameBDBM50314557
Synonyms:(4-(3-(4-(3-nitrophenyl)pyridazino[4,5-b]indolizin-1-ylamino)propyl)piperazin-1-yl)(pyrazin-2-yl)methanone | CHEMBL1090373
TypeSmall organic molecule
Emp. Form.C28H27N9O3
Mol. Mass.537.5725
SMILES[O-][N+](=O)c1cccc(c1)-c1nnc(NCCCN2CCN(CC2)C(=O)c2cnccn2)c2cc3ccccn3c12