Reaction Details
TargetBeta-secretase 1
LigandBDBM50314607
Substrate/Competitorn/a
Meas. Tech.ChEMBL_625146 (CHEMBL1115167)
IC50 30±n/a nM
Citation Zhou, PLi, YFan, YWang, ZChopra, ROlland, AHu, YMagolda, RLPangalos, MReinhart, PHTurner, MJBard, JMalamas, MSRobichaud, AJ Pyridinyl aminohydantoins as small molecule BACE1 inhibitors. Bioorg Med Chem Lett20:2326-9 (2010) 
 
Beta-secretase 1
Name:Beta-secretase 1
Type:Protein
Mol. Mass.:55755.10
Organism:Homo sapiens (Human)
Description:P56817
Residue:501
BDBM50314607
NameBDBM50314607
Synonyms:2-amino-4-(3'-methoxybiphenyl-3-yl)-1-methyl-4-(pyridin-4-yl)-1H-imidazol-5(4H)-one | CHEMBL1092124
TypeSmall organic molecule
Emp. Form.C22H20N4O2
Mol. Mass.372.4198
SMILESCOc1cccc(c1)-c1cccc(c1)C1(N=C(N)N(C)C1=O)c1ccncc1