Reaction Details
TargetBeta-secretase 1
LigandBDBM50314609
Substrate/Competitorn/a
Meas. Tech.ChEMBL_625146 (CHEMBL1115167)
IC50 40±n/a nM
Citation Zhou, PLi, YFan, YWang, ZChopra, ROlland, AHu, YMagolda, RLPangalos, MReinhart, PHTurner, MJBard, JMalamas, MSRobichaud, AJ Pyridinyl aminohydantoins as small molecule BACE1 inhibitors. Bioorg Med Chem Lett20:2326-9 (2010) 
 
Beta-secretase 1
Name:Beta-secretase 1
Type:Protein
Mol. Mass.:55755.10
Organism:Homo sapiens (Human)
Description:P56817
Residue:501
BDBM50314609
NameBDBM50314609
Synonyms:3'-(2-amino-1-methyl-5-oxo-4-(pyridin-4-yl)-4,5-dihydro-1H-imidazol-4-yl)biphenyl-3-carbonitrile | CHEMBL1092475
TypeSmall organic molecule
Emp. Form.C22H17N5O
Mol. Mass.367.4033
SMILESCN1C(N)=NC(C1=O)(c1ccncc1)c1cccc(c1)-c1cccc(c1)C#N