Reaction Details
Target5-hydroxytryptamine receptor 2B
LigandBDBM50314614
Substrate/Competitorn/a
Meas. Tech.ChEMBL_625299 (CHEMBL1109737)
EC50>10000±n/a nM
Citation Liu, KKLefker, BADombroski, MAChiang, PCornelius, PPatterson, TAZeng, YSantucci, STomlinson, EGibbons, CPMarala, RBrown, JAKong, JXLee, EWerner, WWenzel, ZGiragossian, CChen, HCoffey, SB Orally active and brain permeable proline amides as highly selective 5HT2c agonists for the treatment of obesity. Bioorg Med Chem Lett20:2365-9 (2010) 
 
5-hydroxytryptamine receptor 2B
Name:5-hydroxytryptamine receptor 2B
Type:G Protein-Coupled Receptor (GPCR)
Mol. Mass.:54312.47
Organism:Homo sapiens (Human)
Description:Receptor binding assays were performed using human clone stably expressed in CHO cells.
Residue:481
BDBM50314614
NameBDBM50314614
Synonyms:(S)-N-(4-(4,4-dimethylcyclohexyloxy)-2,5-difluorobenzyl)pyrrolidine-2-carboxamide | CHEMBL1091106
TypeSmall organic molecule
Emp. Form.C20H28F2N2O2
Mol. Mass.366.4453
SMILESCC1(C)CCC(CC1)Oc1cc(F)c(CNC(=O)[C@@H]2CCCN2)cc1F