Reaction Details
Target5-hydroxytryptamine receptor 2B
LigandBDBM50314615
Substrate/Competitorn/a
Meas. Tech.ChEMBL_625299 (CHEMBL1109737)
EC50>10000±n/a nM
Citation Liu, KKLefker, BADombroski, MAChiang, PCornelius, PPatterson, TAZeng, YSantucci, STomlinson, EGibbons, CPMarala, RBrown, JAKong, JXLee, EWerner, WWenzel, ZGiragossian, CChen, HCoffey, SB Orally active and brain permeable proline amides as highly selective 5HT2c agonists for the treatment of obesity. Bioorg Med Chem Lett20:2365-9 (2010) 
 
5-hydroxytryptamine receptor 2B
Name:5-hydroxytryptamine receptor 2B
Type:G Protein-Coupled Receptor (GPCR)
Mol. Mass.:54312.47
Organism:Homo sapiens (Human)
Description:Receptor binding assays were performed using human clone stably expressed in CHO cells.
Residue:481
BDBM50314615
NameBDBM50314615
Synonyms:(S)-N-(3,5-difluoro-4-((1s,4s)-4-methylcyclohexyloxy)benzyl)pyrrolidine-2-carboxamide | CHEMBL1093698
TypeSmall organic molecule
Emp. Form.C19H26F2N2O2
Mol. Mass.352.4187
SMILESC[C@H]1CC[C@H](CC1)Oc1c(F)cc(CNC(=O)[C@@H]2CCCN2)cc1F