Reaction Details
Target5-hydroxytryptamine receptor 2C
LigandBDBM50314620
Substrate/Competitorn/a
Meas. Tech.ChEMBL_625151 (CHEMBL1115172)
Ki 324±n/a nM
Citation Liu, KKLefker, BADombroski, MAChiang, PCornelius, PPatterson, TAZeng, YSantucci, STomlinson, EGibbons, CPMarala, RBrown, JAKong, JXLee, EWerner, WWenzel, ZGiragossian, CChen, HCoffey, SB Orally active and brain permeable proline amides as highly selective 5HT2c agonists for the treatment of obesity. Bioorg Med Chem Lett20:2365-9 (2010) 
 
5-hydroxytryptamine receptor 2C
Name:5-hydroxytryptamine receptor 2C
Type:G Protein-Coupled Receptor (GPCR)
Mol. Mass.:51836.79
Organism:Homo sapiens (Human)
Description:P28335
Residue:458
BDBM50314620
NameBDBM50314620
Synonyms:(S)-N-(4-(trifluoromethoxy)benzyl)pyrrolidine-2-carboxamide | CHEMBL1090399
TypeSmall organic molecule
Emp. Form.C13H15F3N2O2
Mol. Mass.288.2656
SMILESFC(F)(F)Oc1ccc(CNC(=O)[C@@H]2CCCN2)cc1