Reaction Details
Target5-hydroxytryptamine receptor 2C
LigandBDBM50314625
Substrate/Competitorn/a
Meas. Tech.ChEMBL_625151 (CHEMBL1115172)
Ki 23±n/a nM
Citation Liu, KKLefker, BADombroski, MAChiang, PCornelius, PPatterson, TAZeng, YSantucci, STomlinson, EGibbons, CPMarala, RBrown, JAKong, JXLee, EWerner, WWenzel, ZGiragossian, CChen, HCoffey, SB Orally active and brain permeable proline amides as highly selective 5HT2c agonists for the treatment of obesity. Bioorg Med Chem Lett20:2365-9 (2010) 
 
5-hydroxytryptamine receptor 2C
Name:5-hydroxytryptamine receptor 2C
Type:G Protein-Coupled Receptor (GPCR)
Mol. Mass.:51836.79
Organism:Homo sapiens (Human)
Description:P28335
Residue:458
BDBM50314625
NameBDBM50314625
Synonyms:(S)-N-(4-(3-fluorophenoxy)benzyl)pyrrolidine-2-carboxamide | CHEMBL1090757
TypeSmall organic molecule
Emp. Form.C18H19FN2O2
Mol. Mass.314.3541
SMILESFc1cccc(Oc2ccc(CNC(=O)[C@@H]3CCCN3)cc2)c1