Reaction Details
Target5-hydroxytryptamine receptor 2B
LigandBDBM50314626
Substrate/Competitorn/a
Meas. Tech.ChEMBL_625152 (CHEMBL1115173)
Ki 1720±n/a nM
Citation Liu, KKLefker, BADombroski, MAChiang, PCornelius, PPatterson, TAZeng, YSantucci, STomlinson, EGibbons, CPMarala, RBrown, JAKong, JXLee, EWerner, WWenzel, ZGiragossian, CChen, HCoffey, SB Orally active and brain permeable proline amides as highly selective 5HT2c agonists for the treatment of obesity. Bioorg Med Chem Lett20:2365-9 (2010) 
 
5-hydroxytryptamine receptor 2B
Name:5-hydroxytryptamine receptor 2B
Type:G Protein-Coupled Receptor (GPCR)
Mol. Mass.:54312.47
Organism:Homo sapiens (Human)
Description:Receptor binding assays were performed using human clone stably expressed in CHO cells.
Residue:481
BDBM50314626
NameBDBM50314626
Synonyms:(S)-N-(4-(benzyloxy)benzyl)pyrrolidine-2-carboxamide | CHEMBL1091104
TypeSmall organic molecule
Emp. Form.C19H22N2O2
Mol. Mass.310.3902
SMILESO=C(NCc1ccc(OCc2ccccc2)cc1)[C@@H]1CCCN1