Reaction Details
Target5-hydroxytryptamine receptor 2C
LigandBDBM50314624
Substrate/Competitorn/a
Meas. Tech.ChEMBL_625154 (CHEMBL1115175)
EC50 183±n/a nM
Citation Liu, KKLefker, BADombroski, MAChiang, PCornelius, PPatterson, TAZeng, YSantucci, STomlinson, EGibbons, CPMarala, RBrown, JAKong, JXLee, EWerner, WWenzel, ZGiragossian, CChen, HCoffey, SB Orally active and brain permeable proline amides as highly selective 5HT2c agonists for the treatment of obesity. Bioorg Med Chem Lett20:2365-9 (2010) 
 
5-hydroxytryptamine receptor 2C
Name:5-hydroxytryptamine receptor 2C
Type:G Protein-Coupled Receptor (GPCR)
Mol. Mass.:51836.79
Organism:Homo sapiens (Human)
Description:P28335
Residue:458
BDBM50314624
NameBDBM50314624
Synonyms:(S)-N-((3',5'-dichlorobiphenyl-4-yl)methyl)pyrrolidine-2-carboxamide | CHEMBL1092167
TypeSmall organic molecule
Emp. Form.C18H18Cl2N2O
Mol. Mass.349.254
SMILESClc1cc(Cl)cc(c1)-c1ccc(CNC(=O)[C@@H]2CCCN2)cc1