Reaction Details
Target5-hydroxytryptamine receptor 2C
LigandBDBM50314613
Substrate/Competitorn/a
Meas. Tech.ChEMBL_625151 (CHEMBL1115172)
Ki 0.9±n/a nM
Citation Liu, KKLefker, BADombroski, MAChiang, PCornelius, PPatterson, TAZeng, YSantucci, STomlinson, EGibbons, CPMarala, RBrown, JAKong, JXLee, EWerner, WWenzel, ZGiragossian, CChen, HCoffey, SB Orally active and brain permeable proline amides as highly selective 5HT2c agonists for the treatment of obesity. Bioorg Med Chem Lett20:2365-9 (2010) 
 
5-hydroxytryptamine receptor 2C
Name:5-hydroxytryptamine receptor 2C
Type:G Protein-Coupled Receptor (GPCR)
Mol. Mass.:51836.79
Organism:Homo sapiens (Human)
Description:P28335
Residue:458
BDBM50314613
NameBDBM50314613
Synonyms:(S)-N-(4-(4,4-dimethylcyclohexyloxy)-5-fluoro-2-methoxybenzyl)pyrrolidine-2-carboxamide | CHEMBL1091105
TypeSmall organic molecule
Emp. Form.C21H31FN2O3
Mol. Mass.378.4808
SMILESCOc1cc(OC2CCC(C)(C)CC2)c(F)cc1CNC(=O)[C@@H]1CCCN1