Reaction Details
TargetDeath-associated protein kinase 3
LigandBDBM50314666
Substrate/Competitorn/a
Meas. Tech.ChEMBL_625624 (CHEMBL1112575)
IC50 713.7±n/a nM
Citation Okamoto, MTakayama, KShimizu, TMuroya, AFuruya, T Structure-activity relationship of novel DAPK inhibitors identified by structure-based virtual screening. Bioorg Med Chem18:2728-34 (2010) 
 
Death-associated protein kinase 3
Name:Death-associated protein kinase 3
Type:PROTEIN
Mol. Mass.:52537.07
Organism:Homo sapiens (Human)
Description:ChEMBL_586564
Residue:454
BDBM50314666
NameBDBM50314666
Synonyms:4-(pyridin-3-ylmethylene)-2-m-tolyloxazol-5(4H)-one | CHEMBL1091786
TypeSmall organic molecule
Emp. Form.C16H12N2O2
Mol. Mass.264.2787
SMILESCc1cccc(c1)C1=N\C(=C/c2cccnc2)C(=O)O1