Reaction Details
TargetOrexin/Hypocretin receptor type 1
LigandBDBM50314677
Substrate/Competitorn/a
Meas. Tech.ChEMBL_625829 (CHEMBL1109765)
Ki 2.3±n/a nM
Citation Coleman, PJSchreier, JDMcGaughey, GBBogusky, MJCox, CDHartman, GDBall, RGHarrell, CMReiss, DRPrueksaritanont, TWinrow, CJRenger, JJ Design and synthesis of conformationally constrained N,N-disubstituted 1,4-diazepanes as potent orexin receptor antagonists. Bioorg Med Chem Lett20:2311-5 (2010) 
 
Orexin/Hypocretin receptor type 1
Name:Orexin/Hypocretin receptor type 1
Type:Protein
Mol. Mass.:47554.50
Organism:Homo sapiens (Human)
Description:O43613
Residue:425
BDBM50314677
NameBDBM50314677
Synonyms:(5-methyl-2-(2H-1,2,3-triazol-2-yl)phenyl)(6-(quinazolin-2-yl)-3,6-diazabicyclo[3.2.1]octan-3-yl)methanone | CHEMBL1091110
TypeSmall organic molecule
Emp. Form.C24H23N7O
Mol. Mass.425.4857
SMILESCc1ccc(c(c1)C(=O)N1CC2CC(C1)N(C2)c1ncc2ccccc2n1)-n1nccn1