Reaction Details
TargetOrexin receptor type 2
LigandBDBM50258741
Substrate/Competitorn/a
Meas. Tech.ChEMBL_625830 (CHEMBL1109766)
Ki 0.6±n/a nM
Citation Coleman, PJSchreier, JDMcGaughey, GBBogusky, MJCox, CDHartman, GDBall, RGHarrell, CMReiss, DRPrueksaritanont, TWinrow, CJRenger, JJ Design and synthesis of conformationally constrained N,N-disubstituted 1,4-diazepanes as potent orexin receptor antagonists. Bioorg Med Chem Lett20:2311-5 (2010) 
 
Orexin receptor type 2
Name:Orexin receptor type 2
Type:Protein
Mol. Mass.:50710.53
Organism:Homo sapiens (Human)
Description:O43614
Residue:444
BDBM50258741
NameBDBM50258741
Synonyms:(5-methyl-2-(2H-1,2,3-triazol-2-yl)phenyl)(4-(quinazolin-2-yl)-1,4-diazepan-1-yl)methanone | CHEMBL469146
TypeSmall organic molecule
Emp. Form.C23H23N7O
Mol. Mass.413.475
SMILESCc1ccc(c(c1)C(=O)N1CCCN(CC1)c1ncc2ccccc2n1)-n1nccn1