Reaction Details
TargetPeptidyl-prolyl cis-trans isomerase NIMA-interacting 1
LigandBDBM50314685
Substrate/Competitorn/a
Meas. Tech.ChEMBL_625852 (CHEMBL1109788)
Ki 2000±n/a nM
Citation Dong, LMarakovits, JHou, XGuo, CGreasley, SDagostino, EFerre, RJohnson, MCKraynov, EThomson, JPathak, VMurray, BW Structure-based design of novel human Pin1 inhibitors (II). Bioorg Med Chem Lett20:2210-4 (2010) 
 
Peptidyl-prolyl cis-trans isomerase NIMA-interacting 1
Name:Peptidyl-prolyl cis-trans isomerase NIMA-interacting 1
Type:PROTEIN
Mol. Mass.:18248.11
Organism:Homo sapiens (Human)
Description:ChEMBL_1502595
Residue:163
BDBM50314685
NameBDBM50314685
Synonyms:(R)-3-(2-naphthamido)-4-(3-chlorophenyl)butanoic acid | CHEMBL1089685
TypeSmall organic molecule
Emp. Form.C21H18ClNO3
Mol. Mass.367.826
SMILESOC(=O)C[C@@H](Cc1cccc(Cl)c1)NC(=O)c1ccc2ccccc2c1