Reaction Details
TargetPeptidyl-prolyl cis-trans isomerase NIMA-interacting 1
LigandBDBM50314690
Substrate/Competitorn/a
Meas. Tech.ChEMBL_625852 (CHEMBL1109788)
Ki 3000±n/a nM
Citation Dong, LMarakovits, JHou, XGuo, CGreasley, SDagostino, EFerre, RJohnson, MCKraynov, EThomson, JPathak, VMurray, BW Structure-based design of novel human Pin1 inhibitors (II). Bioorg Med Chem Lett20:2210-4 (2010) 
 
Peptidyl-prolyl cis-trans isomerase NIMA-interacting 1
Name:Peptidyl-prolyl cis-trans isomerase NIMA-interacting 1
Type:PROTEIN
Mol. Mass.:18248.11
Organism:Homo sapiens (Human)
Description:ChEMBL_1502595
Residue:163
BDBM50314690
NameBDBM50314690
Synonyms:(R)-2-(2-naphthamido)-3-(4-cyanophenyl)propanoic acid | CHEMBL1089698
TypeSmall organic molecule
Emp. Form.C21H16N2O3
Mol. Mass.344.3633
SMILESOC(=O)[C@@H](Cc1ccc(cc1)C#N)NC(=O)c1ccc2ccccc2c1