Reaction Details
TargetPeptidyl-prolyl cis-trans isomerase NIMA-interacting 1
LigandBDBM50314714
Substrate/Competitorn/a
Meas. Tech.ChEMBL_625852 (CHEMBL1109788)
Ki 6±n/a nM
Citation Dong, LMarakovits, JHou, XGuo, CGreasley, SDagostino, EFerre, RJohnson, MCKraynov, EThomson, JPathak, VMurray, BW Structure-based design of novel human Pin1 inhibitors (II). Bioorg Med Chem Lett20:2210-4 (2010) 
 
Peptidyl-prolyl cis-trans isomerase NIMA-interacting 1
Name:Peptidyl-prolyl cis-trans isomerase NIMA-interacting 1
Type:PROTEIN
Mol. Mass.:18248.11
Organism:Homo sapiens (Human)
Description:ChEMBL_1502595
Residue:163
BDBM50314714
NameBDBM50314714
Synonyms:(R)-N-(1-(3-fluorophenyl)-3-hydroxypropan-2-yl)benzo[b]thiophene-2-carboxamide phosphonate | CHEMBL1089602
TypeSmall organic molecule
Emp. Form.C18H16FNO2S
Mol. Mass.329.389
SMILESOC[C@@H](Cc1cccc(F)c1)NC(=O)c1cc2ccccc2s1